Reaction Details
TargetHistone deacetylase 3
LigandBDBM50026430
Substrate/Competitorn/a
Meas. Tech.ChEMBL_1433879 (CHEMBL3388840)
IC50 367±n/a nM
Citation Yao, YLiao, CLi, ZWang, ZSun, QLiu, CYang, YTu, ZJiang, S Design, synthesis, and biological evaluation of 1, 3-disubstituted-pyrazole derivatives as new class I and IIb histone deacetylase inhibitors. Eur J Med Chem86:639-52 (2014) 
 
Histone deacetylase 3
Name:Histone deacetylase 3
Type:Enzyme
Mol. Mass.:48829.55
Organism:Homo sapiens (Human)
Description:O15379
Residue:428
BDBM50026430
NameBDBM50026430
Synonyms:CHEMBL3335288
TypeSmall organic molecule
Emp. Form.C14H17N3O2
Mol. Mass.259.3037
SMILESONC(=O)CCCCc1ccn(n1)-c1ccccc1