Reaction Details
TargetHistone deacetylase 3
LigandBDBM50026450
Substrate/Competitorn/a
Meas. Tech.ChEMBL_1433879 (CHEMBL3388840)
IC50 68±n/a nM
Citation Yao, YLiao, CLi, ZWang, ZSun, QLiu, CYang, YTu, ZJiang, S Design, synthesis, and biological evaluation of 1, 3-disubstituted-pyrazole derivatives as new class I and IIb histone deacetylase inhibitors. Eur J Med Chem86:639-52 (2014) 
 
Histone deacetylase 3
Name:Histone deacetylase 3
Type:Enzyme
Mol. Mass.:48829.55
Organism:Homo sapiens (Human)
Description:O15379
Residue:428
BDBM50026450
NameBDBM50026450
Synonyms:CHEMBL3335283
TypeSmall organic molecule
Emp. Form.C21H23N3O2
Mol. Mass.349.4262
SMILESONC(=O)CCCCc1ccn(Cc2cccc(c2)-c2ccccc2)n1