Reaction Details
TargetHistone deacetylase 1
LigandBDBM50026575
Substrate/Competitorn/a
Meas. Tech.ChEMBL_1433877 (CHEMBL3388838)
IC50 9580±n/a nM
Citation Yao, YLiao, CLi, ZWang, ZSun, QLiu, CYang, YTu, ZJiang, S Design, synthesis, and biological evaluation of 1, 3-disubstituted-pyrazole derivatives as new class I and IIb histone deacetylase inhibitors. Eur J Med Chem86:639-52 (2014) 
 
Histone deacetylase 1
Name:Histone deacetylase 1
Type:Enzyme
Mol. Mass.:55090.27
Organism:Homo sapiens (Human)
Description:Q13547
Residue:482
BDBM50026575
NameBDBM50026575
Synonyms:CHEMBL3335315
TypeSmall organic molecule
Emp. Form.C14H16N4O3
Mol. Mass.288.3018
SMILESONC(=O)CCNC(=O)c1ccn(Cc2ccccc2)n1