Reaction Details
TargetKappa-type opioid receptor
LigandBDBM50026763
Substrate/Competitorn/a
Meas. Tech.ChEMBL_1437491 (CHEMBL3387862)
EC50 205±n/a nM
Citation Mollica, ACarotenuto, ANovellino, ELimatola, ACostante, RPinnen, FStefanucci, APieretti, SBorsodi, ASamavati, RZador, FBenyhe, SDavis, PPorreca, FHruby, VJ Novel cyclic biphalin analogue with improved antinociceptive properties. ACS Med Chem Lett5:1032-6 (2014) 
 
Kappa-type opioid receptor
Name:Kappa-type opioid receptor
Type:G Protein-Coupled Receptor (GPCR)
Mol. Mass.:42692.90
Organism:Rattus norvegicus (rat)
Description:P34975
Residue:380
BDBM50026763
NameBDBM50026763
Synonyms:CHEMBL3331511
TypeSmall organic molecule
Emp. Form.C50H62N10O10S2
Mol. Mass.1027.218
SMILESCC1(C)SSC(C)(C)[C@H](NC(=O)[C@@H](N)Cc2ccc(O)cc2)C(=O)NCC(=O)N[C@@H](Cc2ccccc2)C(=O)NNC(=O)[C@H](Cc2ccccc2)NC(=O)CNC(=O)[C@H]1NC(=O)[C@@H](N)Cc1ccc(O)cc1