Reaction Details
TargetKappa-type opioid receptor
LigandBDBM21014
Substrate/Competitorn/a
Meas. Tech.ChEMBL_1437485 (CHEMBL3387856)
Ki 283±n/a nM
Citation Mollica, ACarotenuto, ANovellino, ELimatola, ACostante, RPinnen, FStefanucci, APieretti, SBorsodi, ASamavati, RZador, FBenyhe, SDavis, PPorreca, FHruby, VJ Novel cyclic biphalin analogue with improved antinociceptive properties. ACS Med Chem Lett5:1032-6 (2014) 
 
Kappa-type opioid receptor
Name:Kappa-type opioid receptor
Type:G Protein-Coupled Receptor (GPCR)
Mol. Mass.:42692.90
Organism:Rattus norvegicus (rat)
Description:P34975
Residue:380
BDBM21014
NameBDBM21014
Synonyms:(2S)-2-amino-N-[(1R)-1-[({[(1S)-1-{N'-[(2S)-2-{2-[(2R)-2-[(2S)-2-amino-3-(4-hydroxyphenyl)propanamido]propanamido]acetamido}-3-phenylpropanoyl]hydrazinecarbonyl}-2-phenylethyl]carbamoyl}methyl)carbamoyl]ethyl]-3-(4-hydroxyphenyl)propanamide Biphalin bis(Tyr-Ala-Gly-PheNH2)hydrazide | enkephalin dimer
TypeAnalgesics
Emp. Form.C46H56N10O10
Mol. Mass.908.9978
SMILESC[C@@H](NC(=O)[C@@H](N)Cc1ccc(O)cc1)C(=O)NCC(=O)N[C@@H](Cc1ccccc1)C(=O)NNC(=O)[C@H](Cc1ccccc1)NC(=O)CNC(=O)[C@@H](C)NC(=O)[C@@H](N)Cc1ccc(O)cc1