Reaction Details
TargetHistone deacetylase 6
LigandBDBM120985
Substrate/Competitorn/a
Meas. Tech.ChEMBL_1433094 (CHEMBL3386351)
EC50 1720±n/a nM
Citation Tang, GWong, JCZhang, WWang, ZZhang, NPeng, ZZhang, ZRong, YLi, SZhang, MYu, LFeng, TZhang, XWu, XWu, JZChen, L Identification of a novel aminotetralin class of HDAC6 and HDAC8 selective inhibitors. J Med Chem57:8026-34 (2014) 
 
Histone deacetylase 6
Name:Histone deacetylase 6
Type:Chromatin regulator; hydrolase; repressor
Mol. Mass.:131381.51
Organism:Homo sapiens (Human)
Description:Q9UBN7
Residue:1215
BDBM120985
NameBDBM120985
Synonyms:US8716285, 42
TypeSmall organic molecule
Emp. Form.C17H17ClN2O4S
Mol. Mass.380.846
SMILESONC(=O)c1ccc2CCC(Cc2c1)NS(=O)(=O)c1cccc(Cl)c1