Reaction Details
TargetHistone deacetylase 3
LigandBDBM50027662
Substrate/Competitorn/a
Meas. Tech.ChEMBL_1433100 (CHEMBL3386357)
IC50>100000±n/a nM
Citation Tang, GWong, JCZhang, WWang, ZZhang, NPeng, ZZhang, ZRong, YLi, SZhang, MYu, LFeng, TZhang, XWu, XWu, JZChen, L Identification of a novel aminotetralin class of HDAC6 and HDAC8 selective inhibitors. J Med Chem57:8026-34 (2014) 
 
Histone deacetylase 3
Name:Histone deacetylase 3
Type:Enzyme
Mol. Mass.:48829.55
Organism:Homo sapiens (Human)
Description:O15379
Residue:428
BDBM50027662
NameBDBM50027662
Synonyms:CHEMBL3338418
TypeSmall organic molecule
Emp. Form.C20H19N5O2
Mol. Mass.361.3972
SMILESONC(=O)c1ccc2CC[C@H](Cc2c1)Nc1nccc(n1)-c1cccnc1