Reaction Details
TargetHistone deacetylase 4
LigandBDBM50027664
Substrate/Competitorn/a
Meas. Tech.ChEMBL_1433101 (CHEMBL3386358)
IC50 67800±n/a nM
Citation Tang, GWong, JCZhang, WWang, ZZhang, NPeng, ZZhang, ZRong, YLi, SZhang, MYu, LFeng, TZhang, XWu, XWu, JZChen, L Identification of a novel aminotetralin class of HDAC6 and HDAC8 selective inhibitors. J Med Chem57:8026-34 (2014) 
 
Histone deacetylase 4
Name:Histone deacetylase 4
Type:Enzyme
Mol. Mass.:119049.39
Organism:Homo sapiens (Human)
Description:P56524
Residue:1084
BDBM50027664
NameBDBM50027664
Synonyms:CHEMBL3338404
TypeSmall organic molecule
Emp. Form.C21H19N3O5
Mol. Mass.393.3927
SMILESONC(=O)c1ccc2CCN(Cc3ccc(o3)-c3cccc(c3)[N+]([O-])=O)Cc2c1