Reaction Details
TargetHistone deacetylase 8
LigandBDBM50027661
Substrate/Competitorn/a
Meas. Tech.ChEMBL_1433105 (CHEMBL3386362)
IC50 390±n/a nM
Citation Tang, GWong, JCZhang, WWang, ZZhang, NPeng, ZZhang, ZRong, YLi, SZhang, MYu, LFeng, TZhang, XWu, XWu, JZChen, L Identification of a novel aminotetralin class of HDAC6 and HDAC8 selective inhibitors. J Med Chem57:8026-34 (2014) 
 
Histone deacetylase 8
Name:Histone deacetylase 8
Type:Enzyme
Mol. Mass.:41749.60
Organism:Homo sapiens (Human)
Description:Q9BY41
Residue:377
BDBM50027661
NameBDBM50027661
Synonyms:CHEMBL3338417
TypeSmall organic molecule
Emp. Form.C20H19N5O2
Mol. Mass.361.3972
SMILESONC(=O)c1ccc2CC[C@@H](Cc2c1)Nc1nccc(n1)-c1cccnc1