Reaction Details
TargetRho-associated protein kinase 1
LigandBDBM50365218
Substrate/Competitorn/a
Meas. Tech.ChEMBL_1432312 (CHEMBL3383292)
IC50 14±n/a nM
Citation Shaw, DHollingworth, GSoldermann, NSprague, ESchuler, WVangrevelinghe, EDuggan, NThomas, MKosaka, TWaters, Nvan Eis, MJ Novel ROCK inhibitors for the treatment of pulmonary arterial hypertension. Bioorg Med Chem Lett24:4812-7 (2014) 
 
Rho-associated protein kinase 1
Name:Rho-associated protein kinase 1
Type:Serine/threonine-protein kinase
Mol. Mass.:158156.77
Organism:Homo sapiens (Human)
Description:Q13464
Residue:1354
BDBM50365218
NameBDBM50365218
Synonyms:CHEMBL1956071 | GSK screening, 29
TypeSmall organic molecule
Emp. Form.C15H18N8O2
Mol. Mass.342.3558
SMILESCCn1c(nc2cncc(C(=O)N3CC[C@H](N)C3)c12)-c1nonc1N