Reaction Details
TargetRho-associated protein kinase 1
LigandBDBM50391898
Substrate/Competitorn/a
Meas. Tech.ChEMBL_1432312 (CHEMBL3383292)
IC50 21±n/a nM
Citation Shaw, DHollingworth, GSoldermann, NSprague, ESchuler, WVangrevelinghe, EDuggan, NThomas, MKosaka, TWaters, Nvan Eis, MJ Novel ROCK inhibitors for the treatment of pulmonary arterial hypertension. Bioorg Med Chem Lett24:4812-7 (2014) 
 
Rho-associated protein kinase 1
Name:Rho-associated protein kinase 1
Type:Serine/threonine-protein kinase
Mol. Mass.:158156.77
Organism:Homo sapiens (Human)
Description:Q13464
Residue:1354
BDBM50391898
NameBDBM50391898
Synonyms:CHEMBL2147538
TypeSmall organic molecule
Emp. Form.C17H19N5
Mol. Mass.293.3663
SMILESCC(C)(N)CNc1nc(cc2cnccc12)-c1ccncc1