Reaction Details
TargetRho-associated protein kinase 1
LigandBDBM50028034
Substrate/Competitorn/a
Meas. Tech.ChEMBL_1432312 (CHEMBL3383292)
IC50 32±n/a nM
Citation Shaw, DHollingworth, GSoldermann, NSprague, ESchuler, WVangrevelinghe, EDuggan, NThomas, MKosaka, TWaters, Nvan Eis, MJ Novel ROCK inhibitors for the treatment of pulmonary arterial hypertension. Bioorg Med Chem Lett24:4812-7 (2014) 
 
Rho-associated protein kinase 1
Name:Rho-associated protein kinase 1
Type:Serine/threonine-protein kinase
Mol. Mass.:158156.77
Organism:Homo sapiens (Human)
Description:Q13464
Residue:1354
BDBM50028034
NameBDBM50028034
Synonyms:CHEMBL3338838
TypeSmall organic molecule
Emp. Form.C18H19N7
Mol. Mass.333.3904
SMILESCC(C)(N)CNc1nc(nc2cnccc12)-c1ccc2[nH]ncc2c1