Reaction Details
TargetRho-associated protein kinase 1
LigandBDBM50028032
Substrate/Competitorn/a
Meas. Tech.ChEMBL_1432312 (CHEMBL3383292)
IC50>1000±n/a nM
Citation Shaw, DHollingworth, GSoldermann, NSprague, ESchuler, WVangrevelinghe, EDuggan, NThomas, MKosaka, TWaters, Nvan Eis, MJ Novel ROCK inhibitors for the treatment of pulmonary arterial hypertension. Bioorg Med Chem Lett24:4812-7 (2014) 
 
Rho-associated protein kinase 1
Name:Rho-associated protein kinase 1
Type:Serine/threonine-protein kinase
Mol. Mass.:158156.77
Organism:Homo sapiens (Human)
Description:Q13464
Residue:1354
BDBM50028032
NameBDBM50028032
Synonyms:CHEMBL3338844
TypeSmall organic molecule
Emp. Form.C20H20N6
Mol. Mass.344.413
SMILESCN1CCN(CC1)c1nc(nc2ccccc12)-c1ccc2[nH]ncc2c1