Reaction Details
TargetRho-associated protein kinase 2
LigandBDBM50028030
Substrate/Competitorn/a
Meas. Tech.ChEMBL_1433145 (CHEMBL3386997)
IC50 20±n/a nM
Citation Shaw, DHollingworth, GSoldermann, NSprague, ESchuler, WVangrevelinghe, EDuggan, NThomas, MKosaka, TWaters, Nvan Eis, MJ Novel ROCK inhibitors for the treatment of pulmonary arterial hypertension. Bioorg Med Chem Lett24:4812-7 (2014) 
 
Rho-associated protein kinase 2
Name:Rho-associated protein kinase 2
Type:Protein
Mol. Mass.:160885.43
Organism:Homo sapiens (Human)
Description:O75116
Residue:1388
BDBM50028030
NameBDBM50028030
Synonyms:CHEMBL3338842
TypeSmall organic molecule
Emp. Form.C17H16N6
Mol. Mass.304.3491
SMILESNCCNc1nc(nc2ccccc12)-c1ccc2[nH]ncc2c1