Reaction Details
TargetSerine/threonine-protein kinase N1
LigandBDBM50391898
Substrate/Competitorn/a
Meas. Tech.ChEMBL_1433150 (CHEMBL3387550)
IC50 35±n/a nM
Citation Shaw, DHollingworth, GSoldermann, NSprague, ESchuler, WVangrevelinghe, EDuggan, NThomas, MKosaka, TWaters, Nvan Eis, MJ Novel ROCK inhibitors for the treatment of pulmonary arterial hypertension. Bioorg Med Chem Lett24:4812-7 (2014) 
 
Serine/threonine-protein kinase N1
Name:Serine/threonine-protein kinase N1
Type:PROTEIN
Mol. Mass.:103928.39
Organism:Homo sapiens (Human)
Description:ChEMBL_1433150
Residue:942
BDBM50391898
NameBDBM50391898
Synonyms:CHEMBL2147538
TypeSmall organic molecule
Emp. Form.C17H19N5
Mol. Mass.293.3663
SMILESCC(C)(N)CNc1nc(cc2cnccc12)-c1ccncc1