Reaction Details
TargetSerine/threonine-protein kinase N1
LigandBDBM50028029
Substrate/Competitorn/a
Meas. Tech.ChEMBL_1433150 (CHEMBL3387550)
IC50>1000±n/a nM
Citation Shaw, DHollingworth, GSoldermann, NSprague, ESchuler, WVangrevelinghe, EDuggan, NThomas, MKosaka, TWaters, Nvan Eis, MJ Novel ROCK inhibitors for the treatment of pulmonary arterial hypertension. Bioorg Med Chem Lett24:4812-7 (2014) 
 
Serine/threonine-protein kinase N1
Name:Serine/threonine-protein kinase N1
Type:PROTEIN
Mol. Mass.:103928.39
Organism:Homo sapiens (Human)
Description:ChEMBL_1433150
Residue:942
BDBM50028029
NameBDBM50028029
Synonyms:CHEMBL3338841
TypeSmall organic molecule
Emp. Form.C20H19N5
Mol. Mass.329.3984
SMILESC1CN(CCN1)c1nc(cc2ccccc12)-c1ccc2[nH]ncc2c1