Reaction Details
TargetSerine/threonine-protein kinase N1
LigandBDBM50028032
Substrate/Competitorn/a
Meas. Tech.ChEMBL_1433150 (CHEMBL3387550)
IC50>1000±n/a nM
Citation Shaw, DHollingworth, GSoldermann, NSprague, ESchuler, WVangrevelinghe, EDuggan, NThomas, MKosaka, TWaters, Nvan Eis, MJ Novel ROCK inhibitors for the treatment of pulmonary arterial hypertension. Bioorg Med Chem Lett24:4812-7 (2014) 
 
Serine/threonine-protein kinase N1
Name:Serine/threonine-protein kinase N1
Type:PROTEIN
Mol. Mass.:103928.39
Organism:Homo sapiens (Human)
Description:ChEMBL_1433150
Residue:942
BDBM50028032
NameBDBM50028032
Synonyms:CHEMBL3338844
TypeSmall organic molecule
Emp. Form.C20H20N6
Mol. Mass.344.413
SMILESCN1CCN(CC1)c1nc(nc2ccccc12)-c1ccc2[nH]ncc2c1