Reaction Details
TargetSerine/threonine-protein kinase N2
LigandBDBM50028031
Substrate/Competitorn/a
Meas. Tech.ChEMBL_1433151 (CHEMBL3387551)
IC50>1000±n/a nM
Citation Shaw, DHollingworth, GSoldermann, NSprague, ESchuler, WVangrevelinghe, EDuggan, NThomas, MKosaka, TWaters, Nvan Eis, MJ Novel ROCK inhibitors for the treatment of pulmonary arterial hypertension. Bioorg Med Chem Lett24:4812-7 (2014) 
 
Serine/threonine-protein kinase N2
Name:Serine/threonine-protein kinase N2
Type:PROTEIN
Mol. Mass.:112029.78
Organism:Homo sapiens (Human)
Description:ChEMBL_1433151
Residue:984
BDBM50028031
NameBDBM50028031
Synonyms:CHEMBL3338843
TypeSmall organic molecule
Emp. Form.C18H18N6
Mol. Mass.318.3757
SMILESNCCCNc1nc(nc2ccccc12)-c1ccc2[nH]ncc2c1