Reaction Details
TargetNeuraminidase
LigandBDBM50028504
Substrate/Competitorn/a
Meas. Tech.ChEMBL_1437607 (CHEMBL3390209)
IC50 43±n/a nM
Citation Xie, YXu, DHuang, BMa, XQi, WShi, FLiu, XZhang, YXu, W Discovery of N-substituted oseltamivir derivatives as potent and selective inhibitors of H5N1 influenza neuraminidase. J Med Chem57:8445-58 (2014) 
 
Neuraminidase
Name:Neuraminidase
Type:PROTEIN
Mol. Mass.:51863.92
Organism:Influenza A virus (strain A/USSR/90/1977 H1N1)
Description:ChEMBL_109720
Residue:470
BDBM50028504
NameBDBM50028504
Synonyms:CHEMBL3342467
TypeSmall organic molecule
Emp. Form.C20H36N2O4
Mol. Mass.368.5108
SMILESCCC(CC)CN[C@H]1CC(=C[C@@H](OC(CC)CC)[C@@H]1NC(C)=O)C(O)=O