Reaction Details
TargetNeuraminidase
LigandBDBM50028514
Substrate/Competitorn/a
Meas. Tech.ChEMBL_1437607 (CHEMBL3390209)
IC50 48±n/a nM
Citation Xie, YXu, DHuang, BMa, XQi, WShi, FLiu, XZhang, YXu, W Discovery of N-substituted oseltamivir derivatives as potent and selective inhibitors of H5N1 influenza neuraminidase. J Med Chem57:8445-58 (2014) 
 
Neuraminidase
Name:Neuraminidase
Type:PROTEIN
Mol. Mass.:51863.92
Organism:Influenza A virus (strain A/USSR/90/1977 H1N1)
Description:ChEMBL_109720
Residue:470
BDBM50028514
NameBDBM50028514
Synonyms:CHEMBL3342477
TypeSmall organic molecule
Emp. Form.C23H32N2O4
Mol. Mass.400.5112
SMILESCCC(CC)O[C@@H]1C=C(C[C@H](NC\C=C\c2ccccc2)[C@H]1NC(C)=O)C(O)=O