Reaction Details
TargetNeuraminidase
LigandBDBM50028516
Substrate/Competitorn/a
Meas. Tech.ChEMBL_1437608 (CHEMBL3390210)
IC50 6.7±n/a nM
Citation Xie, YXu, DHuang, BMa, XQi, WShi, FLiu, XZhang, YXu, W Discovery of N-substituted oseltamivir derivatives as potent and selective inhibitors of H5N1 influenza neuraminidase. J Med Chem57:8445-58 (2014) 
 
Neuraminidase
Name:Neuraminidase
Type:PROTEIN
Mol. Mass.:51863.92
Organism:Influenza A virus (strain A/USSR/90/1977 H1N1)
Description:ChEMBL_109720
Residue:470
BDBM50028516
NameBDBM50028516
Synonyms:CHEMBL3342478
TypeSmall organic molecule
Emp. Form.C27H34N2O4
Mol. Mass.450.5699
SMILESCCC(CC)O[C@@H]1C=C(C[C@H](NCc2ccc(cc2)-c2ccccc2)[C@H]1NC(C)=O)C(O)=O