Reaction Details
TargetNeuraminidase
LigandBDBM50028507
Substrate/Competitorn/a
Meas. Tech.ChEMBL_1437610 (CHEMBL3390212)
IC50 99±n/a nM
Citation Xie, YXu, DHuang, BMa, XQi, WShi, FLiu, XZhang, YXu, W Discovery of N-substituted oseltamivir derivatives as potent and selective inhibitors of H5N1 influenza neuraminidase. J Med Chem57:8445-58 (2014) 
 
Neuraminidase
Name:Neuraminidase
Type:PROTEIN
Mol. Mass.:51863.92
Organism:Influenza A virus (strain A/USSR/90/1977 H1N1)
Description:ChEMBL_109720
Residue:470
BDBM50028507
NameBDBM50028507
Synonyms:CHEMBL3342470
TypeSmall organic molecule
Emp. Form.C19H28N2O4S
Mol. Mass.380.502
SMILESCCC(CC)O[C@@H]1C=C(C[C@H](NCc2cccs2)[C@H]1NC(C)=O)C(O)=O