Reaction Details
TargetOrexin receptor type 2
LigandBDBM50029063
Substrate/Competitorn/a
Meas. Tech.ChEMBL_1434836 (CHEMBL3384633)
Ki 34±n/a nM
Citation Yoshida, YTerauchi, TNaoe, YKazuta, YOzaki, FBeuckmann, CTNakagawa, MSuzuki, MKushida, ITakenaka, OUeno, TYonaga, M Design, synthesis, and structure-activity relationships of a series of novel N-aryl-2-phenylcyclopropanecarboxamide that are potent and orally active orexin receptor antagonists. Bioorg Med Chem22:6071-88 (2014) 
 
Orexin receptor type 2
Name:Orexin receptor type 2
Type:Protein
Mol. Mass.:50710.53
Organism:Homo sapiens (Human)
Description:O43614
Residue:444
BDBM50029063
NameBDBM50029063
Synonyms:CHEMBL3343258
TypeSmall organic molecule
Emp. Form.C25H23N3O4
Mol. Mass.429.4678
SMILESCOc1ccc(OC[C@]2(C[C@H]2C(=O)Nc2cc(ccn2)C#N)c2ccccc2)cc1OC