Reaction Details
TargetOrexin receptor type 2
LigandBDBM50029065
Substrate/Competitorn/a
Meas. Tech.ChEMBL_1434836 (CHEMBL3384633)
Ki 5.0±n/a nM
Citation Yoshida, YTerauchi, TNaoe, YKazuta, YOzaki, FBeuckmann, CTNakagawa, MSuzuki, MKushida, ITakenaka, OUeno, TYonaga, M Design, synthesis, and structure-activity relationships of a series of novel N-aryl-2-phenylcyclopropanecarboxamide that are potent and orally active orexin receptor antagonists. Bioorg Med Chem22:6071-88 (2014) 
 
Orexin receptor type 2
Name:Orexin receptor type 2
Type:Protein
Mol. Mass.:50710.53
Organism:Homo sapiens (Human)
Description:O43614
Residue:444
BDBM50029065
NameBDBM50029065
Synonyms:CHEMBL3343260
TypeSmall organic molecule
Emp. Form.C25H23N3O4
Mol. Mass.429.4678
SMILESCOc1ccc(OCC2(CC2C(=O)Nc2ccc(cn2)C#N)c2ccccc2)cc1OC