Reaction Details
TargetNeuropeptide FF receptor 1
LigandBDBM50029115
Substrate/Competitorn/a
Meas. Tech.ChEMBL_1436237 (CHEMBL3387184)
Ki 1966±n/a nM
Citation Journigan, VBMésangeau, CVyas, NEans, SOCutler, SJMcLaughlin, JPMollereau, CMcCurdy, CR Nonpeptide small molecule agonist and antagonist original leads for neuropeptide FF1 and FF2 receptors. J Med Chem57:8903-27 (2014) 
 
Neuropeptide FF receptor 1
Name:Neuropeptide FF receptor 1
Type:PROTEIN
Mol. Mass.:47840.07
Organism:Homo sapiens (Human)
Description:ChEMBL_1474637
Residue:430
BDBM50029115
NameBDBM50029115
Synonyms:CHEMBL3361414
TypeSmall organic molecule
Emp. Form.C37H48N6O5
Mol. Mass.656.8142
SMILESCC(C)(C)OC(=O)N\C(Nc1ccc(cc1)C(=O)NCC1(CCN(Cc2ccccc2)CC1)Nc1ccccc1)=N/C(=O)OC(C)(C)C