Reaction Details
TargetNeuropeptide FF receptor 1
LigandBDBM50029189
Substrate/Competitorn/a
Meas. Tech.ChEMBL_1436238 (CHEMBL3387185)
Ki 441±n/a nM
Citation Journigan, VBMésangeau, CVyas, NEans, SOCutler, SJMcLaughlin, JPMollereau, CMcCurdy, CR Nonpeptide small molecule agonist and antagonist original leads for neuropeptide FF1 and FF2 receptors. J Med Chem57:8903-27 (2014) 
 
Neuropeptide FF receptor 1
Name:Neuropeptide FF receptor 1
Type:PROTEIN
Mol. Mass.:47840.07
Organism:Homo sapiens (Human)
Description:ChEMBL_1474637
Residue:430
BDBM50029189
NameBDBM50029189
Synonyms:CHEMBL3361410
TypeSmall organic molecule
Emp. Form.C23H32N6O
Mol. Mass.408.5398
SMILESNC(=N)NCCC(=O)NCC1(CCN(Cc2ccccc2)CC1)Nc1ccccc1