Reaction Details
TargetNeuropeptide FF receptor 2
LigandBDBM50029193
Substrate/Competitorn/a
Meas. Tech.ChEMBL_1436239 (CHEMBL3387186)
Ki 3220±n/a nM
Citation Journigan, VBMésangeau, CVyas, NEans, SOCutler, SJMcLaughlin, JPMollereau, CMcCurdy, CR Nonpeptide small molecule agonist and antagonist original leads for neuropeptide FF1 and FF2 receptors. J Med Chem57:8903-27 (2014) 
 
Neuropeptide FF receptor 2
Name:Neuropeptide FF receptor 2
Type:Enzyme Catalytic Domain
Mol. Mass.:60293.78
Organism:Homo sapiens (Human)
Description:NPFF2 0 HUMAN::Q9Y5X5
Residue:522
BDBM50029193
NameBDBM50029193
Synonyms:CHEMBL3361411
TypeSmall organic molecule
Emp. Form.C26H36N4O3
Mol. Mass.452.589
SMILESCC(C)(C)OC(=O)NCC(=O)NCC1(CCN(Cc2ccccc2)CC1)Nc1ccccc1