Reaction Details
TargetNeuropeptide FF receptor 1
LigandBDBM50029109
Substrate/Competitorn/a
Meas. Tech.ChEMBL_1436238 (CHEMBL3387185)
Ki 114±n/a nM
Citation Journigan, VBMésangeau, CVyas, NEans, SOCutler, SJMcLaughlin, JPMollereau, CMcCurdy, CR Nonpeptide small molecule agonist and antagonist original leads for neuropeptide FF1 and FF2 receptors. J Med Chem57:8903-27 (2014) 
 
Neuropeptide FF receptor 1
Name:Neuropeptide FF receptor 1
Type:PROTEIN
Mol. Mass.:47840.07
Organism:Homo sapiens (Human)
Description:ChEMBL_1474637
Residue:430
BDBM50029109
NameBDBM50029109
Synonyms:CHEMBL3361419
TypeSmall organic molecule
Emp. Form.C24H34N6O3
Mol. Mass.454.5652
SMILESCOc1cc(NC2(CNC(=O)CNC(N)=N)CCN(Cc3ccccc3)CC2)cc(OC)c1