Reaction Details
TargetNeuropeptide FF receptor 1
LigandBDBM50029132
Substrate/Competitorn/a
Meas. Tech.ChEMBL_1436238 (CHEMBL3387185)
Ki 432±n/a nM
Citation Journigan, VBMésangeau, CVyas, NEans, SOCutler, SJMcLaughlin, JPMollereau, CMcCurdy, CR Nonpeptide small molecule agonist and antagonist original leads for neuropeptide FF1 and FF2 receptors. J Med Chem57:8903-27 (2014) 
 
Neuropeptide FF receptor 1
Name:Neuropeptide FF receptor 1
Type:PROTEIN
Mol. Mass.:47840.07
Organism:Homo sapiens (Human)
Description:ChEMBL_1474637
Residue:430
BDBM50029132
NameBDBM50029132
Synonyms:CHEMBL3361434
TypeSmall organic molecule
Emp. Form.C23H29Cl2N5O
Mol. Mass.462.415
SMILESNC(=N)NCC(=O)NCC1(Cc2ccc(Cl)c(Cl)c2)CCN(Cc2ccccc2)CC1