Reaction Details
TargetNeuropeptide FF receptor 2
LigandBDBM50029185
Substrate/Competitorn/a
Meas. Tech.ChEMBL_1436933 (CHEMBL3388431)
Ki 304±n/a nM
Citation Journigan, VBMésangeau, CVyas, NEans, SOCutler, SJMcLaughlin, JPMollereau, CMcCurdy, CR Nonpeptide small molecule agonist and antagonist original leads for neuropeptide FF1 and FF2 receptors. J Med Chem57:8903-27 (2014) 
 
Neuropeptide FF receptor 2
Name:Neuropeptide FF receptor 2
Type:Enzyme Catalytic Domain
Mol. Mass.:60293.78
Organism:Homo sapiens (Human)
Description:NPFF2 0 HUMAN::Q9Y5X5
Residue:522
BDBM50029185
NameBDBM50029185
Synonyms:CHEMBL3360834
TypeSmall organic molecule
Emp. Form.C29H39N7O
Mol. Mass.501.6663
SMILESN[C@@H](CCCNC(N)=N)C(=O)NCC1(CCN(Cc2ccc3ccccc3c2)CC1)Nc1ccccc1