Reaction Details
TargetNeuropeptide FF receptor 2
LigandBDBM50029183
Substrate/Competitorn/a
Meas. Tech.ChEMBL_1436933 (CHEMBL3388431)
Ki 1052±n/a nM
Citation Journigan, VBMésangeau, CVyas, NEans, SOCutler, SJMcLaughlin, JPMollereau, CMcCurdy, CR Nonpeptide small molecule agonist and antagonist original leads for neuropeptide FF1 and FF2 receptors. J Med Chem57:8903-27 (2014) 
 
Neuropeptide FF receptor 2
Name:Neuropeptide FF receptor 2
Type:Enzyme Catalytic Domain
Mol. Mass.:60293.78
Organism:Homo sapiens (Human)
Description:NPFF2 0 HUMAN::Q9Y5X5
Residue:522
BDBM50029183
NameBDBM50029183
Synonyms:CHEMBL3360832
TypeSmall organic molecule
Emp. Form.C25H37N7O
Mol. Mass.451.6076
SMILESN[C@@H](CCCNC(N)=N)C(=O)NCC1(CCN(Cc2ccccc2)CC1)Nc1ccccc1