Reaction Details
TargetNeuropeptide FF receptor 2
LigandBDBM50029138
Substrate/Competitorn/a
Meas. Tech.ChEMBL_1436933 (CHEMBL3388431)
Ki 0.800000±n/a nM
Citation Journigan, VBMésangeau, CVyas, NEans, SOCutler, SJMcLaughlin, JPMollereau, CMcCurdy, CR Nonpeptide small molecule agonist and antagonist original leads for neuropeptide FF1 and FF2 receptors. J Med Chem57:8903-27 (2014) 
 
Neuropeptide FF receptor 2
Name:Neuropeptide FF receptor 2
Type:Enzyme Catalytic Domain
Mol. Mass.:60293.78
Organism:Homo sapiens (Human)
Description:NPFF2 0 HUMAN::Q9Y5X5
Residue:522
BDBM50029138
NameBDBM50029138
Synonyms:CHEMBL3360830
TypeSmall organic molecule
Emp. Form.C55H78N14O11
Mol. Mass.1111.295
SMILESCC(C)C[C@@H](N(C)C(=O)[C@H](N)Cc1ccc(O)cc1)C(=O)N[C@@H](Cc1ccccc1)C(=O)N[C@@H](CCC(N)=O)C(=O)N1CCC[C@H]1C(=O)N[C@@H](CCC(N)=O)C(=O)N[C@@H](CCCNC(N)=N)C(=O)N[C@@H](Cc1ccccc1)C(N)=O