Reaction Details
TargetMu-type opioid receptor
LigandBDBM50029109
Substrate/Competitorn/a
Meas. Tech.ChEMBL_1436242 (CHEMBL3387189)
Ki 688±n/a nM
Citation Journigan, VBMésangeau, CVyas, NEans, SOCutler, SJMcLaughlin, JPMollereau, CMcCurdy, CR Nonpeptide small molecule agonist and antagonist original leads for neuropeptide FF1 and FF2 receptors. J Med Chem57:8903-27 (2014) 
 
Mu-type opioid receptor
Name:Mu-type opioid receptor
Type:G Protein-Coupled Receptor (GPCR)
Mol. Mass.:44789.51
Organism:Homo sapiens (Human)
Description:P35372
Residue:400
BDBM50029109
NameBDBM50029109
Synonyms:CHEMBL3361419
TypeSmall organic molecule
Emp. Form.C24H34N6O3
Mol. Mass.454.5652
SMILESCOc1cc(NC2(CNC(=O)CNC(N)=N)CCN(Cc3ccccc3)CC2)cc(OC)c1