Reaction Details
TargetDelta-type opioid receptor
LigandBDBM50029336
Substrate/Competitorn/a
Meas. Tech.ChEMBL_1436243 (CHEMBL3387190)
Ki>5000±n/a nM
Citation Journigan, VBMésangeau, CVyas, NEans, SOCutler, SJMcLaughlin, JPMollereau, CMcCurdy, CR Nonpeptide small molecule agonist and antagonist original leads for neuropeptide FF1 and FF2 receptors. J Med Chem57:8903-27 (2014) 
 
Delta-type opioid receptor
Name:Delta-type opioid receptor
Type:G Protein-Coupled Receptor (GPCR)
Mol. Mass.:40382.98
Organism:Homo sapiens (Human)
Description:Competition binding assays were carried out using membrane preparations from transfected HN9.10 cells that constitutively expressed the delta opioid receptor.
Residue:372
BDBM50029336
NameBDBM50029336
Synonyms:CHEMBL3361416
TypeSmall organic molecule
Emp. Form.C22H30N6O
Mol. Mass.394.5132
SMILESNC(=N)NCC(=O)NCC1(CCN(Cc2ccccc2)CC1)Nc1ccccc1