Reaction Details
TargetPolyphenol oxidase 2
LigandBDBM50192745
Substrate/Competitorn/a
Meas. Tech.ChEMBL_1436297 (CHEMBL3388378)
IC50 8400±n/a nM
Citation Yoshimori, AOyama, TTakahashi, SAbe, HKamiya, TAbe, TTanuma, S Structure-activity relationships of the thujaplicins for inhibition of human tyrosinase. Bioorg Med Chem22:6193-200 (2014) 
 
Polyphenol oxidase 2
Name:Polyphenol oxidase 2
Type:Protein
Mol. Mass.:63923.66
Organism:Agaricus bisporus (Common mushroom)
Description:O42713
Residue:556
BDBM50192745
NameBDBM50192745
Synonyms:CHEBI:75844 | CHEMBL3343985
TypeSmall organic molecule
Emp. Form.C57H98O6
Mol. Mass.879.3844
SMILESCCCCC\C=C/C\C=C/CCCCCCCC(=O)OCC(COC(=O)CCCCCCC\C=C/C\C=C/CCCCC)OC(=O)CCCCCCC\C=C/C\C=C/CCCCC