Reaction Details
TargetMitogen-activated protein kinase 1
LigandBDBM50030889
Substrate/Competitorn/a
Meas. Tech.ChEMBL_1441586 (CHEMBL3376466)
IC50 2100±n/a nM
Citation Deng, YShipps, GWCooper, AEnglish, JMAnnis, DACarr, DNan, YWang, TZhu, HYChuang, CCDayananth, PHruza, AWXiao, LJin, WKirschmeier, PWindsor, WTSamatar, AA Discovery of novel, dual mechanism ERK inhibitors by affinity selection screening of an inactive kinase. J Med Chem57:8817-26 (2014) 
 
Mitogen-activated protein kinase 1
Name:Mitogen-activated protein kinase 1
Type:Ser/Thr Protein Kinase
Mol. Mass.:41392.76
Organism:Homo sapiens (Human)
Description:P28482
Residue:360
BDBM50030889
NameBDBM50030889
Synonyms:CHEMBL3356122
TypeSmall organic molecule
Emp. Form.C27H29ClN4O3S
Mol. Mass.525.062
SMILESOc1ccc(NC(=O)[C@@H]2CCN(CC(=O)N3CCN(CC3)c3ccc(cc3)-c3ccsc3)C2)cc1Cl