Reaction Details
TargetMitogen-activated protein kinase 1
LigandBDBM50030876
Substrate/Competitorn/a
Meas. Tech.ChEMBL_1441588 (CHEMBL3376468)
IC50 120±n/a nM
Citation Deng, YShipps, GWCooper, AEnglish, JMAnnis, DACarr, DNan, YWang, TZhu, HYChuang, CCDayananth, PHruza, AWXiao, LJin, WKirschmeier, PWindsor, WTSamatar, AA Discovery of novel, dual mechanism ERK inhibitors by affinity selection screening of an inactive kinase. J Med Chem57:8817-26 (2014) 
 
Mitogen-activated protein kinase 1
Name:Mitogen-activated protein kinase 1
Type:Ser/Thr Protein Kinase
Mol. Mass.:41392.76
Organism:Homo sapiens (Human)
Description:P28482
Residue:360
BDBM50030876
NameBDBM50030876
Synonyms:CHEMBL3356123
TypeSmall organic molecule
Emp. Form.C27H29ClN4O4
Mol. Mass.508.997
SMILESOc1ccc(NC(=O)[C@@H]2CCN(CC(=O)N3CCN(CC3)c3ccc(cc3)-c3ccoc3)C2)cc1Cl