Reaction Details
TargetMitogen-activated protein kinase 1
LigandBDBM50030879
Substrate/Competitorn/a
Meas. Tech.ChEMBL_1441588 (CHEMBL3376468)
IC50>10000±n/a nM
Citation Deng, YShipps, GWCooper, AEnglish, JMAnnis, DACarr, DNan, YWang, TZhu, HYChuang, CCDayananth, PHruza, AWXiao, LJin, WKirschmeier, PWindsor, WTSamatar, AA Discovery of novel, dual mechanism ERK inhibitors by affinity selection screening of an inactive kinase. J Med Chem57:8817-26 (2014) 
 
Mitogen-activated protein kinase 1
Name:Mitogen-activated protein kinase 1
Type:Ser/Thr Protein Kinase
Mol. Mass.:41392.76
Organism:Homo sapiens (Human)
Description:P28482
Residue:360
BDBM50030879
NameBDBM50030879
Synonyms:CHEMBL3356126
TypeSmall organic molecule
Emp. Form.C25H28Cl2N4O4
Mol. Mass.519.42
SMILESCC(=O)c1ccc(cc1)N1CCN(CC1)C(=O)CN1CC[C@H](C1)C(=O)Nc1cc(Cl)c(O)c(Cl)c1