Reaction Details
TargetMitogen-activated protein kinase 1
LigandBDBM104963
Substrate/Competitorn/a
Meas. Tech.ChEMBL_1441588 (CHEMBL3376468)
IC50>10000±n/a nM
Citation Deng, YShipps, GWCooper, AEnglish, JMAnnis, DACarr, DNan, YWang, TZhu, HYChuang, CCDayananth, PHruza, AWXiao, LJin, WKirschmeier, PWindsor, WTSamatar, AA Discovery of novel, dual mechanism ERK inhibitors by affinity selection screening of an inactive kinase. J Med Chem57:8817-26 (2014) 
 
Mitogen-activated protein kinase 1
Name:Mitogen-activated protein kinase 1
Type:Ser/Thr Protein Kinase
Mol. Mass.:41392.76
Organism:Homo sapiens (Human)
Description:P28482
Residue:360
BDBM104963
NameBDBM104963
Synonyms:CHEMBL507361 US11701360, PD0325901 US8575391, Q
TypeSmall organic molecule
Emp. Form.C16H14F3IN2O4
Mol. Mass.482.193
SMILESOC[C@@H](O)CONC(=O)c1ccc(F)c(F)c1Nc1ccc(I)cc1F