Reaction Details
TargetHistone-lysine N-methyltransferase EHMT2
LigandBDBM50031317
Substrate/Competitorn/a
Meas. Tech.ChEMBL_1436393 (CHEMBL3389596)
IC50>150000±n/a nM
Citation Chen, SWang, YZhou, WLi, SPeng, JShi, ZHu, JLiu, YCDing, HLin, YLi, LCheng, SLiu, JLu, TJiang, HLiu, BZheng, MLuo, C Identifying novel selective non-nucleoside DNA methyltransferase 1 inhibitors through docking-based virtual screening. J Med Chem57:9028-41 (2014) 
 
Histone-lysine N-methyltransferase EHMT2
Name:Histone-lysine N-methyltransferase EHMT2
Type:Enzyme
Mol. Mass.:132339.87
Organism:Homo sapiens (Human)
Description:Q96KQ7
Residue:1210
BDBM50031317
NameBDBM50031317
Synonyms:CHEMBL3358015
TypeSmall organic molecule
Emp. Form.C25H25N3O
Mol. Mass.383.4855
SMILESOC(CNCCc1c[nH]c2ccccc12)Cn1c2ccccc2c2ccccc12