Reaction Details
TargetDNA (cytosine-5)-methyltransferase 1
LigandBDBM50031321
Substrate/Competitorn/a
Meas. Tech.ChEMBL_1436389 (CHEMBL3389592)
IC50 2500±n/a nM
Citation Chen, SWang, YZhou, WLi, SPeng, JShi, ZHu, JLiu, YCDing, HLin, YLi, LCheng, SLiu, JLu, TJiang, HLiu, BZheng, MLuo, C Identifying novel selective non-nucleoside DNA methyltransferase 1 inhibitors through docking-based virtual screening. J Med Chem57:9028-41 (2014) 
 
DNA (cytosine-5)-methyltransferase 1
Name:DNA (cytosine-5)-methyltransferase 1
Type:PROTEIN
Mol. Mass.:183211.58
Organism:Mus musculus
Description:ChEMBL_109519
Residue:1620
BDBM50031321
NameBDBM50031321
Synonyms:CHEMBL3358029
TypeSmall organic molecule
Emp. Form.C33H35N3O2
Mol. Mass.505.6499
SMILESCC(C)NC[C@@H](O)COC(Cn1c2ccccc2c2ccccc12)Cn1c2ccccc2c2ccccc12