Reaction Details
TargetPeptidase 1
LigandBDBM50031712
Substrate/Competitorn/a
Meas. Tech.ChEMBL_1443313 (CHEMBL3374743)
IC50 47±n/a nM
Citation Newton, GKPerrior, TRJenkins, KMajor, MRKey, REStewart, MRFirth-Clark, SLloyd, SMZhang, JFrancis-Newton, NJRichardson, JPChen, JLai, PGarrod, DRRobinson, C The discovery of potent, selective, and reversible inhibitors of the house dust mite peptidase allergen Der p 1: an innovative approach to the treatment of allergic asthma. J Med Chem57:9447-62 (2014) 
 
Peptidase 1
Name:Peptidase 1
Type:Enzyme
Mol. Mass.:36101.04
Organism:Dermatophagoides pteronyssinus (European house dust mite)
Description:P08176
Residue:320
BDBM50031712
NameBDBM50031712
Synonyms:CHEMBL3360283
TypeSmall organic molecule
Emp. Form.C30H37F3N4O5
Mol. Mass.590.6338
SMILESCC(C)[C@H](NC(=O)[C@H](C)NC(=O)[C@@H](NC(=O)c1ccccc1)C(C)(C)C)C(=O)C(=O)NCc1ccc(cc1)C(F)(F)F