Reaction Details
TargetPeptidase 1
LigandBDBM103020
Substrate/Competitorn/a
Meas. Tech.ChEMBL_1443313 (CHEMBL3374743)
IC50 14±n/a nM
Citation Newton, GKPerrior, TRJenkins, KMajor, MRKey, REStewart, MRFirth-Clark, SLloyd, SMZhang, JFrancis-Newton, NJRichardson, JPChen, JLai, PGarrod, DRRobinson, C The discovery of potent, selective, and reversible inhibitors of the house dust mite peptidase allergen Der p 1: an innovative approach to the treatment of allergic asthma. J Med Chem57:9447-62 (2014) 
 
Peptidase 1
Name:Peptidase 1
Type:Enzyme
Mol. Mass.:36101.04
Organism:Dermatophagoides pteronyssinus (European house dust mite)
Description:P08176
Residue:320
BDBM103020
NameBDBM103020
Synonyms:US8541363, PVA-026
TypeSmall organic molecule
Emp. Form.C28H42N4O5
Mol. Mass.514.6569
SMILESCC(C)[C@H](NC(=O)[C@H](C)NC(=O)[C@@H](NC(=O)c1ccccc1)C(C)(C)C)C(=O)C(=O)NC1CCCCC1