Reaction Details
TargetCathepsin B
LigandBDBM50031710
Substrate/Competitorn/a
Meas. Tech.ChEMBL_1443314 (CHEMBL3374744)
IC50 459±n/a nM
Citation Newton, GKPerrior, TRJenkins, KMajor, MRKey, REStewart, MRFirth-Clark, SLloyd, SMZhang, JFrancis-Newton, NJRichardson, JPChen, JLai, PGarrod, DRRobinson, C The discovery of potent, selective, and reversible inhibitors of the house dust mite peptidase allergen Der p 1: an innovative approach to the treatment of allergic asthma. J Med Chem57:9447-62 (2014) 
 
Cathepsin B
Name:Cathepsin B
Type:Enzyme
Mol. Mass.:37819.69
Organism:Homo sapiens (Human)
Description:gi_63102437
Residue:339
BDBM50031710
NameBDBM50031710
Synonyms:CHEMBL3360285
TypeSmall organic molecule
Emp. Form.C30H40N4O5
Mol. Mass.536.6624
SMILESCC(C)[C@H](NC(=O)[C@H](C)NC(=O)[C@@H](NC(=O)c1ccccc1)C(C)(C)C)C(=O)C(=O)N[C@H](C)c1ccccc1