Reaction Details
TargetCathepsin B
LigandBDBM50031698
Substrate/Competitorn/a
Meas. Tech.ChEMBL_1443314 (CHEMBL3374744)
IC50 81±n/a nM
Citation Newton, GKPerrior, TRJenkins, KMajor, MRKey, REStewart, MRFirth-Clark, SLloyd, SMZhang, JFrancis-Newton, NJRichardson, JPChen, JLai, PGarrod, DRRobinson, C The discovery of potent, selective, and reversible inhibitors of the house dust mite peptidase allergen Der p 1: an innovative approach to the treatment of allergic asthma. J Med Chem57:9447-62 (2014) 
 
Cathepsin B
Name:Cathepsin B
Type:Enzyme
Mol. Mass.:37819.69
Organism:Homo sapiens (Human)
Description:gi_63102437
Residue:339
BDBM50031698
NameBDBM50031698
Synonyms:CHEMBL3360289
TypeSmall organic molecule
Emp. Form.C32H41N5O6
Mol. Mass.591.6978
SMILESCC(C)[C@H](NC(=O)[C@H](C)NC(=O)[C@H](Cc1ccccc1)NC(=O)c1ccccc1)C(=O)C(=O)NCC(=O)N1CCCCC1