Reaction Details
TargetTyrosine-protein phosphatase non-receptor type 22
LigandBDBM50031904
Substrate/Competitorn/a
Meas. Tech.ChEMBL_1437898 (CHEMBL3384862)
Ki 26220±n/a nM
Citation Hou, XLi, RLi, KYu, XSun, JPFang, H Fast identification of novel lymphoid tyrosine phosphatase inhibitors using target-ligand interaction-based virtual screening. J Med Chem57:9309-22 (2014) 
 
Tyrosine-protein phosphatase non-receptor type 22
Name:Tyrosine-protein phosphatase non-receptor type 22
Type:n/a
Mol. Mass.:91712.31
Organism:Homo sapiens (Human)
Description:Q9Y2R2
Residue:807
BDBM50031904
NameBDBM50031904
Synonyms:CHEMBL3360903
TypeSmall organic molecule
Emp. Form.C24H23N3O3S
Mol. Mass.433.523
SMILES[#6]-c1c(\[#6]=[#6]-2\[#6](=O)-[#7]-[#6](=S)-[#7]-[#6]-2=O)c2ccccc2n1-[#6]-[#6]-[#8]-c1ccc(-[#6])cc1-[#6]