Reaction Details
TargetHistone deacetylase 8
LigandBDBM50032269
Substrate/Competitorn/a
Meas. Tech.ChEMBL_1440127 (CHEMBL3382540)
Ki 3000±n/a nM
Citation Maolanon, ARVilladsen, JSChristensen, NJHoeck, CFriis, THarris, PGotfredsen, CHFristrup, POlsen, CA Methyl effect in azumamides provides insight into histone deacetylase inhibition by macrocycles. J Med Chem57:9644-57 (2014) 
 
Histone deacetylase 8
Name:Histone deacetylase 8
Type:Enzyme
Mol. Mass.:41749.60
Organism:Homo sapiens (Human)
Description:Q9BY41
Residue:377
BDBM50032269
NameBDBM50032269
Synonyms:CHEMBL3352992
TypeSmall organic molecule
Emp. Form.C28H37N5O6
Mol. Mass.539.6233
SMILESCC(C)[C@H]1NC(=O)C[C@H](NC(=O)[C@@H](Cc2c[nH]c3ccccc23)NC(=O)[C@@H](C)NC1=O)\C=C\CCCC(O)=O