Reaction Details
TargetPolyamine deacetylase HDAC10
LigandBDBM50032268
Substrate/Competitorn/a
Meas. Tech.ChEMBL_1440129 (CHEMBL3382542)
Ki 1600±n/a nM
Citation Maolanon, ARVilladsen, JSChristensen, NJHoeck, CFriis, THarris, PGotfredsen, CHFristrup, POlsen, CA Methyl effect in azumamides provides insight into histone deacetylase inhibition by macrocycles. J Med Chem57:9644-57 (2014) 
 
Polyamine deacetylase HDAC10
Name:Polyamine deacetylase HDAC10
Type:Chromatin regulator; hydrolase; repressor
Mol. Mass.:71431.89
Organism:Homo sapiens (Human)
Description:Q969S8
Residue:669
BDBM50032268
NameBDBM50032268
Synonyms:CHEMBL3352990
TypeSmall organic molecule
Emp. Form.C26H36N4O6
Mol. Mass.500.5872
SMILESCC(C)[C@H]1NC(=O)C[C@H](NC(=O)[C@@H](Cc2ccccc2)NC(=O)[C@@H](C)NC1=O)\C=C\CCCC(O)=O