Reaction Details
TargetHistone deacetylase 11
LigandBDBM50032274
Substrate/Competitorn/a
Meas. Tech.ChEMBL_1440130 (CHEMBL3382543)
Ki 1500±n/a nM
Citation Maolanon, ARVilladsen, JSChristensen, NJHoeck, CFriis, THarris, PGotfredsen, CHFristrup, POlsen, CA Methyl effect in azumamides provides insight into histone deacetylase inhibition by macrocycles. J Med Chem57:9644-57 (2014) 
 
Histone deacetylase 11
Name:Histone deacetylase 11
Type:Chromatin regulator; hydrolase; repressor
Mol. Mass.:39187.66
Organism:Homo sapiens (Human)
Description:Q96DB2
Residue:347
BDBM50032274
NameBDBM50032274
Synonyms:CHEMBL3352996
TypeSmall organic molecule
Emp. Form.C26H36N4O6
Mol. Mass.500.5872
SMILESCC(C)[C@H]1NC(=O)C[C@@H](C\C=C/CCC(O)=O)NC(=O)[C@@H](Cc2ccccc2)NC(=O)[C@@H](C)NC1=O