Reaction Details
TargetHistone deacetylase 2
LigandBDBM50032272
Substrate/Competitorn/a
Meas. Tech.ChEMBL_1440125 (CHEMBL3382538)
Ki 300±n/a nM
Citation Maolanon, ARVilladsen, JSChristensen, NJHoeck, CFriis, THarris, PGotfredsen, CHFristrup, POlsen, CA Methyl effect in azumamides provides insight into histone deacetylase inhibition by macrocycles. J Med Chem57:9644-57 (2014) 
 
Histone deacetylase 2
Name:Histone deacetylase 2
Type:Chromatin regulator; hydrolase; repressor
Mol. Mass.:55356.54
Organism:Homo sapiens (Human)
Description:Q92769
Residue:488
BDBM50032272
NameBDBM50032272
Synonyms:CHEMBL3352994
TypeSmall organic molecule
Emp. Form.C26H38N4O7
Mol. Mass.518.6025
SMILESCC(C)[C@H]1NC(=O)C[C@@H](CCCCCC(O)=O)NC(=O)[C@@H](Cc2ccc(O)cc2)NC(=O)[C@@H](C)NC1=O